All
Search
Images
Videos
Maps
News
More
Shopping
Flights
Travel
Notebook
Report an inappropriate content
Please select one of the options below.
Not Relevant
Offensive
Adult
Child Sexual Abuse
Length
All
Short (less than 5 minutes)
Medium (5-20 minutes)
Long (more than 20 minutes)
Date
All
Past 24 hours
Past week
Past month
Past year
Resolution
All
Lower than 360p
360p or higher
480p or higher
720p or higher
1080p or higher
Source
All
Dailymotion
Vimeo
Metacafe
Hulu
VEVO
Myspace
MTV
CBS
Fox
CNN
MSN
Price
All
Free
Paid
Clear filters
SafeSearch:
Moderate
Strict
Moderate (default)
Off
Filter
Jump to key moments of Task Assembledebug Not Found in Root Project 'Android
3:00
From 01:32
Running the Project on Terminal
Gradle: Task 'run' not found in root project
YouTube
ICT Trainer
9:50
From 00:38
Initializing a React Native Project
Solution for Android project not found in React Native
YouTube
GreenPs
1:45
From 00:18
Running Gradle Task Assembled Debugging
Fixed 😄 Android Studio Stuck at Running Gradle task 'assembleDebug'
YouTube
Harshdeep Kaur
1:42
From 00:01
Introduction to the Error
FAILURE: Build failed with an exception Exception: Gradle task assembleDebu
…
YouTube
PWH SERVICES
4:16
From 02:28
Android Licenses Not Accepted
Solved : Flutter finished with error: Gradle task assembleDebug failed wit
…
YouTube
Abdul Rehman Aslam
2:22
From 00:21
Opening the Project and Terminal
Flutter App stuck at “Running Gradle task 'assembleDebug'. SOLUTION
YouTube
Aditya Thakur
3:46
From 0:00
Introduction and Problem Description
Flutter | Fixed App Stuck at "Running Gradle task" 'assembleDebug' Issue
YouTube
Nasir Soft
14:49
From 00:48
Setting Up the Project
Debugging in Android Studio: Android Programming
YouTube
Brian Fraser
7:15
From 0:00
Introduction to Breakpoints
Android Studio: How to Attach the Debugger
YouTube
DJ Malone
15:52
From 0:00
Introduction of Building Your First App - Part 1 - Getting Started with Android Development
Building Your First App - Part 1 - Getting Started with Android Development
YouTube
Courses by iBrent
1:05
Gradle task assembleDebug failed with exit code 1 flutter in android
…
8.9K views
Apr 15, 2024
YouTube
Click 2 Start
1:39
Fix Android Error Execution failed for task ':app:processDebugReso
…
6.4K views
Jun 16, 2024
YouTube
KDTechs
3:00
Gradle: Task 'run' not found in root project
4.4K views
Jun 8, 2023
YouTube
ICT Trainer
1:42
Gradle task assembleDebug failed with exit code 1 | How to fix Gradl
…
52.3K views
Oct 23, 2023
YouTube
Click 2 Start
1:42
FAILURE: Build failed with an exception Exception: Gradle task
…
51.7K views
Aug 28, 2022
YouTube
PWH SERVICES
1:15
[Solved] Execution failed for task ':shared_preferences_android:co
…
11.2K views
10 months ago
YouTube
IntelliLogics
3:27
Flutter Error Fix: Gradle Task 'AssembleDebug' Failed with Exit
…
7.7K views
10 months ago
YouTube
Fazal TechWorld
5:41
fix flutter error : gradle task assembledebug failed with exit co
…
176.9K views
Mar 6, 2020
YouTube
Far ID
2:22
Flutter App stuck at “Running Gradle task 'assembleDebug'. SOL
…
153.6K views
Dec 15, 2020
YouTube
Aditya Thakur
2:36
Exception : Gradle task assembleDebug failed with exit co
…
95.3K views
Nov 1, 2020
YouTube
Learn with Asad
1:48
How to fix "Task 'wrapper' not found in project ':app'." error in Android
…
7.8K views
Aug 22, 2023
YouTube
iRekha Tech Solutions
6:17
gradle task assembledebug failed with exit code 1 - fix flutter error
54.4K views
May 28, 2021
YouTube
Tech Now Tv
3:09
A problem occurred evaluating root project 'MyApplication'
14.4K views
Aug 18, 2022
YouTube
mb-techs
11:43
error message : Task :app:installDebug FAILED | React
…
33.3K views
May 13, 2022
YouTube
Prerna Sinha
2:12
How to Fix Gradle Error in Android Studio | Could not resolve com.an
…
59.7K views
Feb 15, 2023
YouTube
Codex Creator
0:58
[Solved] Execution failed for task :flutter_plugin_android_lifecycle:c
…
17.8K views
10 months ago
YouTube
IntelliLogics
10:15
How to fix Task 'wrapper' not found in project ':app'. error in Android S
…
15.6K views
Jun 17, 2021
YouTube
Fix Amma
1:12
Android : Task 'prepareKotlinBuildScriptModel' n
…
1.4K views
May 1, 2023
YouTube
Hey Delphi
0:57
[Solved] a failure occurred while executing com.android.build.gradl
…
49K views
Dec 1, 2021
YouTube
IntelliLogics
4:36
Android Studio - Fix the error "Could not resolve com.android.to
…
35.3K views
Jan 20, 2023
YouTube
Programmer World
1:55
Fix Gradle Error in Android Studio | Plugin is not in org.gradle Names
…
75.1K views
Aug 16, 2023
YouTube
The Code City
2:32
How to fix Android Studio: Failed to apply plugin 'com.android.internal
…
55.3K views
Jan 16, 2022
YouTube
SL7 Tech
15:16
Android Project Structure for Beginners: Complete Guide for un
…
57 views
1 year ago
YouTube
CODE KPR!
1:56
Your project's Gradle version is incompatible with the Java versio
…
86.9K views
Aug 21, 2023
YouTube
Mithun FLutter
3:43
gradle task assembledebug failed with exit code 1 - fix flutter error |
…
46K views
Nov 12, 2022
YouTube
Web Tech
1:21
How to Solve Could not determine the dependencies of task ‘:app:co
…
44.6K views
Jan 16, 2022
YouTube
True Coders
4:32
How to Fix Execution failed for task ':app:compileFlutterBuildDebug'
13.2K views
Aug 5, 2023
YouTube
Techi4u
3:59
How to fix : " Could not resolve all artifacts for configuration ':classp
…
24.6K views
Feb 17, 2023
YouTube
Amjad Achyq
1:07
How to fix Could not resolve all files for configuration app:debugCompi
…
16.3K views
Mar 31, 2024
YouTube
123codings
3:16
How to Fix Android Error A problem was found with the configuration
…
351 views
Jun 16, 2024
YouTube
KDTechs
See more videos
More like this
Feedback